Org.apache.spark.sparkexception job aborted due to stage failure

Teams. Q&A for work. Connect and share knowledge

Error: org.apache.spark.SparkException: Job aborted due to stage failure: Task 0 in stage 1985.0 failed 4 times, most recent failure: Lost task 0.3 in stage 1985.0 (TID 57569, 10.139.64.12, executor 15): com.microsoft.sqlserver.jdbc.SQLServerException: Conversion failed when converting the nvarchar value 'Aug' to data type int.Jun 9, 2020 · Our reports and datasets imports data from Databricks Spark Delta tables using the Spark connector into our Premium P1 capacity. We're using incremental refresh for the larger (fact) tables, but we're having trouble with the initial refresh after publishing the pbix file. When refreshing large datasets it often fails after 30-60 minutes with ...

Did you know?

FYI in Spark 2.4 a lot of you will probably encounter this issue. Kryo serialization has gotten better but in many cases you cannot use spark.kryo.unsafe=true or the naive kryo serializer. For a quick fix try changing the following in your Spark configuration spark.kryo.unsafe="false" OR. spark.serializer="org.apache.spark.serializer ...Jul 7, 2019 · 1 I'm trying to use Linear Regression on a simple dataframe with one feature and one label using Python pyspark in Databricks. However, I'm running into some issues with stage failure. I've reviewed many similar problems, but most of them are in Scala or are out of the scope of what I'm doing here. Versions: Feb 14, 2020 · Go into the cluster settings, under Advanced select spark and paste spark.driver.maxResultSize 0 (for unlimited) or whatever the value suits you. Using 0 is not recommended. You should optimize the job by re partitioning. For more details, refer "Spark Configurations - Application Properties". Hope this helps. Do let us know if you any further ... Sep 21, 2021 · I am trying to solve the problems from O'Reilly book of Learning Spark. Below part of code is working fine from pyspark.sql.types import * from pyspark.sql import SparkSession from pyspark.sql.func... Hi! I run 2 to spark an option SPARK_MAJOR_VERSION=2 pyspark --master yarn --verbose spark starts, I run the SC and get an error, the field in the table exactly there. not the problem SPARK_MAJOR_VERSION=2 pyspark --master yarn --verbose SPARK_MAJOR_VERSION is set to 2, using Spark2 Python 2.7.12 ...Caused by: org.apache.spark.SparkException: Job aborted due to stage failure: Serialized task 2:0 was 155731289 bytes, which exceeds max allowed: spark.rpc.message.maxSize (134217728 bytes). Consider increasing spark.rpc.message.maxSize or using broadcast variables for large values.I am running spark jobs using datafactory in azure databricks. My cluster vesion is 9.1 LTS ML (includes Apache Spark 3.1.2, Scala 2.12). I am writing data on azure blob storage. While writing job ...Nov 12, 2018 · Pyspark. spark.SparkException: Job aborted due to stage failure: Task 0 in stage 15.0 failed 1 times, java.net.SocketException: Connection reset Hot Network Questions Does America, like non-democratic countries like China, also have factions? Jan 10, 2020 · Teams. Q&A for work. Connect and share knowledge within a single location that is structured and easy to search. Learn more about Teams Teams. Q&A for work. Connect and share knowledge within a single location that is structured and easy to search. Learn more about TeamsException in thread "main" org.apache.spark.SparkException : Job aborted due to stage failure: Task 3 in stage 0.0 failed 4 times, most recent failure: Lost task 3.3 in stage 0.0 (TID 14, 192.168.10.38): ExecutorLostFailure (executor 3 lost) Driver stacktrace:Feb 14, 2020 · Go into the cluster settings, under Advanced select spark and paste spark.driver.maxResultSize 0 (for unlimited) or whatever the value suits you. Using 0 is not recommended. You should optimize the job by re partitioning. For more details, refer "Spark Configurations - Application Properties". Hope this helps. Do let us know if you any further ... Mar 30, 2020 · org.apache.spark.SparkException: Job aborted due to stage failure: Task 29 in stage 0.0 failed 4 times, most recent failure: Lost task 29.3 in stage 0.0 (TID 92, 10.252.252.125, executor 23): ExecutorLostFailure (executor 23 exited caused by one of the running tasks) Reason: Remote RPC client disassociated.

org.apache.spark.SparkException: Job aborted due to stage failure: Task XXX in stage YYY failed 4 times, most recent failure: Lost task XXX in stage YYY (TID ZZZ, ip-xxx-xx-x-xxx.compute.internal, executor NNN): ExecutorLostFailure (executor NNN exited caused by one of the running tasks) Reason: ... 解決方法 理由コードの検索Pyspark. spark.SparkException: Job aborted due to stage failure: Task 0 in stage 15.0 failed 1 times, java.net.SocketException: Connection reset Hot Network Questions Does America, like non-democratic countries like China, also have factions?You need to change this parameter in the cluster configuration. Go into the cluster settings, under Advanced select spark and paste spark.driver.maxResultSize 0 (for unlimited) or whatever the value suits you. Using 0 is not recommended. You should optimize the job by re partitioning.Nov 11, 2021 · 1 Answer. PySpark DF are lazy loading. When you call .show () you are asking the prior steps to execute and anyone of them may not work, you just can't see it until you call .show () because they haven't executed. I go back to earlier steps and call .collect () on each operation of the DF. This will at least allow you to isolate where the bad ...

Here are some ideas to fix this error: Serializable the class. Declare the instance only within the lambda function passed in map. Make the NotSerializable object as a static and create it once per machine. Call rdd.forEachPartition and create the NotSerializable object in there like this: rdd.forEachPartition (iter -> { NotSerializable ... May 11, 2022 · If absolutely necessary you can set the property spark.driver.maxResultSize to a value <X>g higher than the value reported in the exception message in the cluster Spark config ( AWS | Azure ): spark.driver.maxResultSize < X > g. The default value is 4g. For details, see Application Properties. If you set a high limit, out-of-memory errors can ... …

Reader Q&A - also see RECOMMENDED ARTICLES & FAQs. Apr 8, 2019 · scala - org.apache.spark.SparkException: Job aborted d. Possible cause: When I run the demo : from pyspark.ml.linalg import Vectors import tempfile conf = SparkC.

Solution 1. Check your environment variables. You are getting “py4j.protocol.Py4JError: org.apache.spark.api.python.PythonUtils.getEncryptionEnabled does not exist in the JVM” due to Spark environemnt variables are not set right.I installed apache-spark and pyspark on my machine (Ubuntu), and in Pycharm, I also updated the environment variables (e.g. spark_home, pyspark_python). I'm trying to do: import os, sys os.environ['

Check Apache Spark installation on Windows 10 steps. Use different versions of Apache Spark (tried 2.4.3 / 2.4.2 / 2.3.4). Disable firewall windows and antivirus that I have installed. Tried to initialize the SparkContext manually with sc = spark.sparkContext (found this possible solution at this question here in Stackoverflow, didn´t work for ...Exception in thread "main" org.apache.spark.SparkException : Job aborted due to stage failure: Task 3 in stage 0.0 failed 4 times, most recent failure: Lost task 3.3 in stage 0.0 (TID 14, 192.168.10.38): ExecutorLostFailure (executor 3 lost) Driver stacktrace:The copy activity was interrupted part way through as the source database went offline which then caused the failure to complete writing the files properly. These were easily found as they were the most recently modified files.

Sep 21, 2021 · I am trying to solve the proble Sep 1, 2022 · use dbr version : 10.4 LTS (includes Apache Spark 3.2.1, Scala 2.12) for spark configuartion edit the spark tab by editing the cluster and use below code there. "spark.sql.ansi.enabled false" Mar 31, 2019 · org.apache.spark.SparkException: Job aborted due to stage failure: Task in stage failed,Lost task in stage : ExecutorLostFailure (executor 4 lost) Ask Question Asked 4 years, 5 months ago Hi! I run 2 to spark an option SPARK_MAJOR_VERSION=2 pysAug 23, 2021 · org.apache.spark.SparkException: Job a 1 Answer. Sorted by: 1. You need to create an RDD of type RDD [Tuple [str]] but in your code, the line: rdd = spark.sparkContext.parallelize (comments) returns RDD [str] which then fails when you try to convert it to dataframe with that given schema. Try modifying that line to:org.apache.spark.SparkException: Job aborted due to stage failure: Task 29 in stage 0.0 failed 4 times, most recent failure: Lost task 29.3 in stage 0.0 (TID 92, 10.252.252.125, executor 23): ExecutorLostFailure (executor 23 exited caused by one of the running tasks) Reason: Remote RPC client disassociated. Here is the full list of commands creating the list, writing it to For Spark jobs submitted with --deploy-mode cluster, run the following command on the master node to find stage failures in the YARN application logs. Replace application_id with the ID of your Spark application (for example, application_1572839353552_0008 ). yarn logs -applicationId application_id | grep "Job aborted due to stage failure" -A 10. When I run the demo : from pyspark.ml.linalg import Vectors importorg.apache.spark.SparkException: Job aborted due to stage failure: 8 DData collection is indirect, with data being stored b Solve : org.apache.spark.SparkException: Job aborted due to stage failure 1 Spark Error: Executor XXX finished with state EXITED message Command exited with code 1 exitStatus 1Mar 29, 2020 · Check Apache Spark installation on Windows 10 steps. Use different versions of Apache Spark (tried 2.4.3 / 2.4.2 / 2.3.4). Disable firewall windows and antivirus that I have installed. Tried to initialize the SparkContext manually with sc = spark.sparkContext (found this possible solution at this question here in Stackoverflow, didn´t work for ... Jul 17, 2020 · Caused by: org.apache.spar Nov 1, 2017 · Saved searches Use saved searches to filter your results more quickly I am new to Spark and recently installed it on a mac (with[Dec 6, 2018 · 1. "Accept timed out"Nov 10, 2016 · Hi! I run 2 to spark an option SPARK_MA >>Job aborted due to stage failure: Total size of serialized results of 19 tasks (4.2 GB) is bigger than spark.driver.maxResultSize (4.0 GB)'.. The exception was raised by the IDbCommand interface. Please take a look at following document about maxResultsize issue:strange org.apache.spark.SparkException: Job aborted due to stage failure again. I'm trying to deploy spark application on standalone mode. In this application I'm training Naive Bayes classifier by using tf-idf vectors. I wrote application in similar manner to this post ( Spark MLLib TFIDF implementation for LogisticRegression ) The difference ...